Target
P2X purinoceptor 3
Ligand
BDBM86487
Substrate
Ki
47.3±n/a nM
Comments
PDSP_4061
Citation
 Jarvis, MFBianchi, BUchic, JTCartmell, JLee, CHWilliams, MFaltynek, C [3H]A-317491, a novel high-affinity non-nucleotide antagonist that specifically labels human P2X2/3 and P2X3 receptors. J Pharmacol Exp Ther 310:407-16 (2004)  
Target
Name:
P2X purinoceptor 3
Synonyms:
ATP receptor P2RX3 P2X purinoceptor 3 P2X purinoceptor 3 (P2X3) P2X3 purinoceptor p2x3 + hsa
Type:
Protein
Mol. Mass.:
44292.02
Organism:
Homo sapiens (Human)
Description:
P56373
Residue:
397
  
Inhibitor
Name:
BDBM86487
Synonyms:
ATP,3'-deoxy NSC_0
Type:
Small organic molecule
Emp. Form.:
C10H16N5O12P3
Mol. Mass.:
491.1816
SMILES:
Nc1ncnc2n(cnc12)[C@@H]1O[C@H](COP(O)(=O)OP(O)(=O)OP(O)(O)=O)C[C@H]1O
: