Target
P2X purinoceptor 3
Ligand
BDBM86486
Substrate
Ki
7.5±n/a nM
Comments
PDSP_4074
Citation
 Jarvis, MFBianchi, BUchic, JTCartmell, JLee, CHWilliams, MFaltynek, C [3H]A-317491, a novel high-affinity non-nucleotide antagonist that specifically labels human P2X2/3 and P2X3 receptors. J Pharmacol Exp Ther 310:407-16 (2004)  
Target
Name:
P2X purinoceptor 3
Synonyms:
ATP receptor P2RX3 P2X purinoceptor 3 P2X purinoceptor 3 (P2X3) P2X3 purinoceptor p2x3 + hsa
Type:
Protein
Mol. Mass.:
44292.02
Organism:
Homo sapiens (Human)
Description:
P56373
Residue:
397
  
Inhibitor
Name:
BDBM86486
Synonyms:
ATP,TNP NSC_644357
Type:
Small organic molecule
Emp. Form.:
C16H12N8O19P3
Mol. Mass.:
713.2327
SMILES:
[#7]-c1ncnc2n(cnc12)-[#6]-1-[#8]-[#6](-[#6]-[#8]P([#8-])(=O)[#8]P([#8-])(=O)[#8]P([#8-])([#8-])=O)-[#6]-2-[#8]C3([#8]-[#6]-1-2)[#6](=[#6]\[#6](-[#6]=[#6]3-[#7+](-[#8-])=O)=[#7+](/[#8-])-[#8-])-[#7+](-[#8-])=O
: