Target
Histamine H3 receptor
Ligand
BDBM22914
Substrate
Ki
72.6±n/a nM
Comments
PDSP_1847
Citation
 Hancock, AABennani, YLBush, ENEsbenshade, TAFaghih, RFox, GBJacobson, PKnourek-Segel, VKrueger, KMNuss, MEPan, JBShapiro, RWitte, DGYao, BB Antiobesity effects of A-331440, a novel non-imidazole histamine H3 receptor antagonist. Eur J Pharmacol 487:183-97 (2004)  
Target
Name:
Histamine H3 receptor
Synonyms:
G-protein coupled receptor 97 HH3R HRH3 Histamine H3 receptor (H3) Histamine receptor (H3 and H4)
Type:
G Protein-Coupled Receptor (GPCR)
Mol. Mass.:
48691.47
Organism:
Homo sapiens (Human)
Description:
Binding assays were using CHO cells stably expressing hH3R receptors.
Residue:
445
  
Inhibitor
Name:
BDBM22914
Synonyms:
CHEMBL260374 Thioperamide | US11622967, Compound Thioperamide
Type:
Small organic molecule
Emp. Form.:
C15H24N4S
Mol. Mass.:
292.443
SMILES:
S=C(NC1CCCCC1)N1CCC(CC1)c1cnc[nH]1
: