Target
Epidermal growth factor receptor
Ligand
BDBM3600
Substrate
EGF-R Substrate
Meas. Tech.
Kinase Inhibition Assay
pH
7.4±n/a
Temperature
295.15±n/a K
IC50
0.13±n/a nM
Citation
 Rewcastle, GWPalmer, BDThompson, AWBridges, AJCody, DRZhou, HRFry, DWMcMichael, ADenny, WA Tyrosine Kinase Inhibitors. 10. Isomeric 4-[(3-Bromophenyl)amino]pyrido[d]- pyrimidines Are Potent ATP Binding Site Inhibitors of the Tyrosine Kinase Function of the Epidermal Growth Factor Receptor J Med Chem 39:1823-35 (1996)  
Target
Name:
Epidermal growth factor receptor
Synonyms:
EGF Receptor Substrate EGFR_HUMAN ERBB1 Epidermal Growth Factor Receptor erbB-1 Epidermal growth factor receptor (EGFR) HER1 Proto-oncogene c-ErbB-1 Tyrosine-Protein Kinase ErbB-1
Type:
Receptor Kinase Domain
Mol. Mass.:
134279.59
Organism:
Homo sapiens (Human)
Description:
P00533
Residue:
1210
  
Inhibitor
Name:
BDBM3600
Synonyms:
4-N-(3-bromophenyl)pyrido[3,4-d]pyrimidine-4,6-diamine Pyrido[3,4-d]pyrimidine 7b
Type:
Small organic molecule
Emp. Form.:
C13H10BrN5
Mol. Mass.:
316.156
SMILES:
Nc1cc2c(Nc3cccc(Br)c3)ncnc2cn1
:
Substrate
Name:
EGF-R Substrate
Synonyms:
Type:
Peptide
Mol. Mass.:
4119.23
Organism:
Description:
The sequence is based on a portion of phospholipase C-gamma. 10 uM ATP containing 1 uCi of [gamma-32P]ATP as co-substrate.
Residue:
38