Target
Bombesin receptor subtype-3
Ligand
BDBM86500
Substrate
Ki
2400±n/a nM
Comments
PDSP_3749
Citation
 Mantey, SACoy, DHEntsuah, LKJensen, RT Development of bombesin analogs with conformationally restricted amino acid substitutions with enhanced selectivity for the orphan receptor human bombesin receptor subtype 3. J Pharmacol Exp Ther 310:1161-70 (2004)  
Target
Name:
Bombesin receptor subtype-3
Synonyms:
BRS-3 BRS3_HUMAN Bombesin like receptor 3
Type:
Enzyme Catalytic Domain
Mol. Mass.:
44424.45
Organism:
Homo sapiens (Human)
Description:
Bombesin 3 BRS3 HUMAN::P32247
Residue:
399
  
Inhibitor
Name:
BDBM86500
Synonyms:
CAS_0 [D-Tyr6,Beta-Ala11,Phe13,Beta-Dap(Pr)14]Bn(6-14)
Type:
Small organic molecule
Emp. Form.:
C54H71N15O11
Mol. Mass.:
1106.2354
SMILES:
CC(C)[C@H](NC(=O)[C@H](C)NC(=O)[C@H](Cc1c[nH]c2ccccc12)NC(=O)[C@H](CCC(N)=O)NC(=O)[C@H](N)Cc1ccc(O)cc1)C(=O)NCCC(=O)N[C@@H](Cc1cnc[nH]1)C(=O)N[C@@H](Cc1ccccc1)C(=O)NCC(N)C(N)=O
: