Target
Neuromedin-B receptor
Ligand
BDBM50071745
Substrate
Ki
0.55±n/a nM
Comments
PDSP_1339
Citation
 Mantey, SACoy, DHEntsuah, LKJensen, RT Development of bombesin analogs with conformationally restricted amino acid substitutions with enhanced selectivity for the orphan receptor human bombesin receptor subtype 3. J Pharmacol Exp Ther 310:1161-70 (2004)  
Target
Name:
Neuromedin-B receptor
Synonyms:
Bombesin 1 NMBR Neuromedin B Neuromedin-B receptor | Neuromedin-B-preferring bombesin receptor
Type:
Enzyme Catalytic Domain
Mol. Mass.:
43447.11
Organism:
Homo sapiens (Human)
Description:
Bombesin 1 NMBR 0::P28336
Residue:
390
  
Inhibitor
Name:
BDBM50071745
Synonyms:
CHEMBL403317 Gly-Asn-Leu-Trp-Ala-Thr-Gly-His-Phe-Met-NH2(Neuromedin B) | NMB
Type:
Small organic molecule
Emp. Form.:
C52H73N15O12S
Mol. Mass.:
1132.294
SMILES:
CSCC[C@H](NC(=O)[C@H](Cc1ccccc1)NC(=O)[C@H](Cc1cnc[nH]1)NC(=O)CNC(=O)[C@@H](NC(=O)[C@H](C)NC(=O)[C@H](Cc1c[nH]c2ccccc12)NC(=O)[C@H](CC(C)C)NC(=O)[C@H](CC(N)=O)NC(=O)CN)[C@@H](C)O)C(N)=O
: