Target
D(4) dopamine receptor
Ligand
BDBM50171290
Substrate
Ki
1000±n/a nM
Comments
PDSP_3734
Citation
 Rinaldi-Carmona, MBarth, FCongy, CMartinez, SOustric, DPério, APoncelet, MMaruani, JArnone, MFinance, OSoubrié, PLe Fur, G SR147778 [5-(4-bromophenyl)-1-(2,4-dichlorophenyl)-4-ethyl-N-(1-piperidinyl)-1H-pyrazole-3-carboxamide], a new potent and selective antagonist of the CB1 cannabinoid receptor: biochemical and pharmacological characterization. J Pharmacol Exp Ther 310:905-14 (2004)  
Target
Name:
D(4) dopamine receptor
Synonyms:
D(2C) dopamine receptor DOPAMINE D4.2 DRD4 Dopamine D4 receptor
Type:
Enzyme
Mol. Mass.:
48373.19
Organism:
Homo sapiens (Human)
Description:
P21917
Residue:
419
  
Inhibitor
Name:
BDBM50171290
Synonyms:
5-(4-Bromo-phenyl)-1-(2,4-dichloro-phenyl)-4-ethyl-1H-pyrazole-3-carboxylic acid piperidin-1-ylamide SR 147778
Type:
Small organic molecule
Emp. Form.:
C23H23BrCl2N4O
Mol. Mass.:
522.265
SMILES:
CCc1c(nn(c1-c1ccc(Br)cc1)-c1ccc(Cl)cc1Cl)C(=O)NN1CCCCC1
: