Target
Opioid receptor delta 1
Ligand
BDBM86258
Substrate
Ki
278±n/a nM
Comments
PDSP_1250
Citation
 Gilbert, AKHosztafi, SMahurter, LPasternak, GW Pharmacological characterization of dihydromorphine, 6-acetyldihydromorphine and dihydroheroin analgesia and their differentiation from morphine. Eur J Pharmacol 492:123-30 (2004)  
Target
Name:
Opioid receptor delta 1
Synonyms:
Type:
PROTEIN
Mol. Mass.:
40708.41
Organism:
Bos taurus
Description:
ChEMBL_863801
Residue:
372
  
Inhibitor
Name:
BDBM86258
Synonyms:
CAS_23552-18-3 NSC_5980
Type:
Small organic molecule
Emp. Form.:
C17H19NO3
Mol. Mass.:
285.3377
SMILES:
CN1CCC23C4Oc5c2c(CC1C3C=CC4O)ccc5O
: