Target
Gamma-aminobutyric acid receptor subunit alpha-1
Ligand
BDBM50001765
Substrate
Ki
0.31±n/a nM
Comments
PDSP_1906
Citation
 Sullivan, SKPetroski, REVerge, GGross, RSFoster, ACGrigoriadis, DE Characterization of the interaction of indiplon, a novel pyrazolopyrimidine sedative-hypnotic, with the GABAA receptor. J Pharmacol Exp Ther 311:537-46 (2004)  
Target
Name:
Gamma-aminobutyric acid receptor subunit alpha-1
Synonyms:
Benzodiazepine central GABA A Benzodiazepine GABA A Benzodiazepine Type II GABA A Benzodiazepine Type IIM GABA A Benzodiazepine omega2 GABA A alpha1 GABA receptor alpha-1 subunit GABA-PICROTOXIN Gabra-1 TBPS
Type:
Enzyme
Mol. Mass.:
51770.21
Organism:
Rattus norvegicus (Rat)
Description:
P62813
Residue:
455
  
Inhibitor
Name:
BDBM50001765
Synonyms:
8-chloro-6-(2-chlorophenyl)-1-methyl-4H-[1,2,4]triazolo[4,3-a][1,4]benzodiazepine Halcion | TRIAZOLAM
Type:
Small organic molecule
Emp. Form.:
C17H12Cl2N4
Mol. Mass.:
343.21
SMILES:
Cc1nnc2CN=C(c3ccccc3Cl)c3cc(Cl)ccc3-n12
: