Target
Fatty-acid amide hydrolase 1 [30-579]
Ligand
BDBM86533
Substrate
Ki
>10000±n/a nM
Comments
PDSP_4178
Citation
 Appendino, GDe Petrocellis, LTrevisani, MMinassi, ADaddario, NMoriello, ASGazzieri, DLigresti, ACampi, BFontana, GPinna, CGeppetti, PDi Marzo, V Development of the first ultra-potent "capsaicinoid" agonist at transient receptor potential vanilloid type 1 (TRPV1) channels and its therapeutic potential. J Pharmacol Exp Ther 312:561-70 (2005)  
Target
Name:
Fatty-acid amide hydrolase 1 [30-579]
Synonyms:
Anandamide amidohydrolase 1 Faah Fatty Acid Amide Hydrolase Fatty-acid amide hydrolase (FAAH) Fatty-acid amide hydrolase 1 (FAAH) Oleamide hydrolase 1
Type:
Single-pass membrane protein; homodimer
Mol. Mass.:
60474.00
Organism:
Rattus norvegicus (rat)
Description:
P97612 (aa 30-579)
Residue:
550
  
Inhibitor
Name:
BDBM86533
Synonyms:
PhAR, epoxy
Type:
Small organic molecule
Emp. Form.:
C34H49NO6
Mol. Mass.:
567.756
SMILES:
CCCCCCC(CCC1OC1CCCCCCC(=O)NCc1ccc(O)c(OC)c1)OC(=O)Cc1ccccc1
: