Target
Neuronal acetylcholine receptor subunit alpha-5
Ligand
BDBM50004108
Substrate
Ki
156±n/a nM
Comments
PDSP_1311
Citation
 Grinevich, VPLetchworth, SRLindenberger, KAMenager, JMary, VSadieva, KABuhlman, LMBohme, GAPradier, LBenavides, JLukas, RJBencherif, M Heterologous expression of human {alpha}6{beta}4{beta}3{alpha}5 nicotinic acetylcholine receptors: binding properties consistent with their natural expression require quaternary subunit assembly including the {alpha}5 subunit. J Pharmacol Exp Ther 312:619-26 (2005)  
Target
Name:
Neuronal acetylcholine receptor subunit alpha-5
Synonyms:
ACHA5_RAT Cholinergic, Nicotinic Alpha6Beta3Beta4Alpha5 | Chrna5
Type:
Enzyme Catalytic Domain
Mol. Mass.:
51875.01
Organism:
RAT
Description:
Cholinergic, Nicotinic Alpha6Beta3Beta4Alpha5 0 RAT::P20420
Residue:
452
  
Inhibitor
Name:
BDBM50004108
Synonyms:
(+-)-nicotine (RS)-nicotine CHEMBL440464 Nicotine-(+) US11667638, Example Nicotine US9284322, Nicotine nicotine
Type:
Small organic molecule
Emp. Form.:
C10H14N2
Mol. Mass.:
162.2316
SMILES:
CN1CCCC1c1cccnc1
: