Target
D(3) dopamine receptor
Ligand
BDBM86559
Substrate
Meas. Tech.
Binding Assay
pH
7.4±0
Temperature
295.15±0 K
Ki
1.6e+3±n/a nM
Citation
 Carlsson, JColeman, RGSetola, VIrwin, JJFan, HSchlessinger, ASali, ARoth, BLShoichet, BK Ligand discovery from a dopamine D3 receptor homology model and crystal structure. Nat Chem Biol 7:769-78 (2011)  
Target
Name:
D(3) dopamine receptor
Synonyms:
DOPAMINE D3 DRD3_HUMAN Dopamine D3 receptor (D3) Dopamine receptor Dopamine receptor D3
Type:
Mol. Mass.:
44243.43
Organism:
Homo sapiens (Human)
Description:
Residue:
400
  
Inhibitor
Name:
BDBM86559
Synonyms:
Azanium analog, 31
Type:
Small organic molecule
Emp. Form.:
C15H26N3OS
Mol. Mass.:
296.451
SMILES:
C[NH+](C)C(C)(C)CNC(=O)N1CCC[C@@H]1c1cccs1
: