Target
Aurora kinase C
Ligand
BDBM86598
Substrate
Meas. Tech.
In Vitro Kinase Assay
IC50
40.5±0.0 nM
Citation
 Kwiatkowski, NDeng, XWang, JTan, LVilla, FSantaguida, SHuang, HCMitchison, TMusacchio, AGray, N Selective aurora kinase inhibitors identified using a taxol-induced checkpoint sensitivity screen. ACS Chem Biol 7:185-96 (2012)  
Target
Name:
Aurora kinase C
Synonyms:
AIE2 AIRK3 AURKC Aurora Kinase C (Aurora-C) Aurora kinase C (AURKC) Aurora-C/INCENP Aurora/Ipl1/Eg2 protein 2 Serine/threonine-protein kinase 13 | Serine/threonine-protein kinase Aurora-C
Type:
Enzyme
Mol. Mass.:
35602.43
Organism:
Homo sapiens (Human)
Description:
Amino acid residues 1-309 were expressed as His-tagged fusion protein using baculovirus expression system.
Residue:
309
  
Inhibitor
Name:
BDBM86598
Synonyms:
Benzo[e]pyrimido[5,4-b][1,4]diazepin-6(11H)-one, 3
Type:
Small organic molecule
Emp. Form.:
C24H27N7O
Mol. Mass.:
429.5175
SMILES:
CN1CCN(CC1)c1ccc(Nc2ncc3N(C)C(=O)c4ccccc4N(C)c3n2)cc1
: