Target
Hrh3 protein
Ligand
BDBM50158595
Substrate
Ki
1.45±n/a nM
Comments
PDSP_4080
Citation
 Esbenshade, TAFox, GBKrueger, KMMiller, TRKang, CHDenny, LIWitte, DGYao, BBPan, LWetter, JMarsh, KBennani, YLCowart, MDSullivan, JPHancock, AA Pharmacological properties of ABT-239 [4-(2-{2-[(2R)-2-Methylpyrrolidinyl]ethyl}-benzofuran-5-yl)benzonitrile]: I. Potent and selective histamine H3 receptor antagonist with drug-like properties. J Pharmacol Exp Ther 313:165-75 (2005)  
Target
Name:
Hrh3 protein
Synonyms:
HISTAMINE H3 Hrh3 protein
Type:
Enzyme Catalytic Domain
Mol. Mass.:
37860.96
Organism:
RAT
Description:
Q5PPG3
Residue:
344
  
Inhibitor
Name:
BDBM50158595
Synonyms:
(4'-(3-((2R,5R)-2,5-dimethylpyrrolidin-1-yl)propoxy)biphenyl-4-yl)(morpholino)methanone CHEMBL179702 {4'-[3-((2R,5R)-2,5-Dimethyl-pyrrolidin-1-yl)-propoxy]-biphenyl-4-yl}-morpholin-4-yl-methanone
Type:
Small organic molecule
Emp. Form.:
C26H34N2O3
Mol. Mass.:
422.5598
SMILES:
C[C@@H]1CC[C@@H](C)N1CCCOc1ccc(cc1)-c1ccc(cc1)C(=O)N1CCOCC1
: