Target
Hrh3 protein
Ligand
BDBM50074629
Substrate
Ki
0.11±n/a nM
Comments
PDSP_4081
Citation
 Esbenshade, TAFox, GBKrueger, KMMiller, TRKang, CHDenny, LIWitte, DGYao, BBPan, LWetter, JMarsh, KBennani, YLCowart, MDSullivan, JPHancock, AA Pharmacological properties of ABT-239 [4-(2-{2-[(2R)-2-Methylpyrrolidinyl]ethyl}-benzofuran-5-yl)benzonitrile]: I. Potent and selective histamine H3 receptor antagonist with drug-like properties. J Pharmacol Exp Ther 313:165-75 (2005)  
Target
Name:
Hrh3 protein
Synonyms:
HISTAMINE H3 Hrh3 protein
Type:
Enzyme Catalytic Domain
Mol. Mass.:
37860.96
Organism:
RAT
Description:
Q5PPG3
Residue:
344
  
Inhibitor
Name:
BDBM50074629
Synonyms:
4-[(1R,2R)-2-(5,5-Dimethyl-hex-1-ynyl)-cyclopropyl]-1H-imidazole Cipralisant
Type:
Small organic molecule
Emp. Form.:
C14H20N2
Mol. Mass.:
216.322
SMILES:
CC(C)(C)CCC#C[C@@H]1C[C@H]1c1cnc[nH]1
: