Target
Nuclear receptor ROR-gamma
Ligand
BDBM404642
Substrate
Meas. Tech.
Biological Assay
IC50
5.00±n/a nM
Citation
 Lapointe, BTFuller, PHGunaydin, HLiu, KMolinari, DFPu, QScott, METrotter, BWZhang, H Substituted bicyclic pyrazole compounds as RORgammaT inhibitors and uses thereof US Patent  US10344000 Publication Date 7/9/2019 
Target
Name:
Nuclear receptor ROR-gamma
Synonyms:
NR1F3 Nuclear receptor ROR-gamma (RORC) RAR-related orphan receptor C (RORc) RORG RZRG Retinoid-related orphan receptor-gamma (RORc)
Type:
Enzyme Catalytic Domain
Mol. Mass.:
58218.40
Organism:
Homo sapiens (Human)
Description:
P51449
Residue:
518
  
Inhibitor
Name:
BDBM404642
Synonyms:
4-((R or S)-1-(2-chloro- 6-(1- (trifluoromethyl)cyclo- propyl)benzoyl)-6- (hydroxymethyl)- 4,5,6,7-tetrahydro-1H- indazol-3-yl)cyclohex- 3-ene-1-carboxylic acid | US10344000, Example 7D
Type:
Small organic molecule
Emp. Form.:
C26H26ClF3N2O4
Mol. Mass.:
522.944
SMILES:
OCC1CCc2c(C1)n(nc2C1=CCC(CC1)C(O)=O)C(=O)c1c(Cl)cccc1C1(CC1)C(F)(F)F
: