Target
Promotilin
Ligand
BDBM86688
Substrate
Ki
323.59±n/a nM
Comments
PDSP_6113
Citation
 Thielemans, LDepoortere, IPerret, JRobberecht, PLiu, YThijs, TCarreras, CBurgeon, EPeeters, TL Desensitization of the human motilin receptor by motilides. J Pharmacol Exp Ther 313:1397-405 (2005)  
Target
Name:
Promotilin
Synonyms:
MLN Motilin | Promotilin
Type:
Enzyme Catalytic Domain
Mol. Mass.:
12919.83
Organism:
Homo sapiens (Human)
Description:
Motilin 0 HUMAN::P12872
Residue:
115
  
Inhibitor
Name:
BDBM86688
Synonyms:
EM-B enolether
Type:
Small organic molecule
Emp. Form.:
C37H65NO11
Mol. Mass.:
699.9121
SMILES:
CC[C@H]1OC(=O)[C@H](C)[C@@H](O[C@H]2C[C@@](C)(OC)[C@@H](O)[C@H](C)O2)[C@H](C)[C@@H](O[C@@H]2O[C@H](C)C[C@@H]([C@H]2O)N(C)C)[C@]2(C)CC(C)=C(O2)[C@H](C)[C@@H](O)[C@@H]1C
: