Target
Promotilin
Ligand
BDBM86687
Substrate
Ki
>10000±n/a nM
Comments
PDSP_6111
Citation
 Thielemans, LDepoortere, IPerret, JRobberecht, PLiu, YThijs, TCarreras, CBurgeon, EPeeters, TL Desensitization of the human motilin receptor by motilides. J Pharmacol Exp Ther 313:1397-405 (2005)  
Target
Name:
Promotilin
Synonyms:
MLN Motilin | Promotilin
Type:
Enzyme Catalytic Domain
Mol. Mass.:
12919.83
Organism:
Homo sapiens (Human)
Description:
Motilin 0 HUMAN::P12872
Residue:
115
  
Inhibitor
Name:
BDBM86687
Synonyms:
ME36
Type:
Small organic molecule
Emp. Form.:
C39H67NO13
Mol. Mass.:
757.9482
SMILES:
CCC1OC(=O)C(C)C(OC2CC(C)(OC)C(O)C(C)O2)C(C)C(OC2OC(C)CC(C2O)N(C)CC#C)C(C)(O)CC(C)C(=O)C(C)C(O)C1(C)O
: