Target
Promotilin
Ligand
BDBM86686
Substrate
Ki
537.03±n/a nM
Comments
PDSP_6112
Citation
 Thielemans, LDepoortere, IPerret, JRobberecht, PLiu, YThijs, TCarreras, CBurgeon, EPeeters, TL Desensitization of the human motilin receptor by motilides. J Pharmacol Exp Ther 313:1397-405 (2005)  
Target
Name:
Promotilin
Synonyms:
MLN Motilin | Promotilin
Type:
Enzyme Catalytic Domain
Mol. Mass.:
12919.83
Organism:
Homo sapiens (Human)
Description:
Motilin 0 HUMAN::P12872
Residue:
115
  
Inhibitor
Name:
BDBM86686
Synonyms:
Erythromycin A Enol Ether | ME4
Type:
Small organic molecule
Emp. Form.:
C35H61NO12
Mol. Mass.:
687.8583
SMILES:
CC[C@H]1OC(=O)[C@H](C)[C@@H](O[C@H]2C[C@@](C)(OC)[C@@H](O)[C@H](C)O2)[C@H](C)[C@@H](O[C@@H]2O[C@H](C)C[C@H](N)[C@H]2O)[C@@]2(C)CC(C)=C(O2)[C@H](C)[C@@H](O)[C@]1(C)O
: