Target
Cysteinyl leukotriene receptor 1
Ligand
BDBM86692
Substrate
Ki
>10000±n/a nM
Comments
PDSP_4863
Citation
 Mimura, HIkemura, TKotera, OSawada, MTashiro, SFuse, EUeno, KManabe, HOhshima, EKarasawa, AMiyaji, H Inhibitory effect of the 4-aminotetrahydroquinoline derivatives, selective chemoattractant receptor-homologous molecule expressed on T helper 2 cell antagonists, on eosinophil migration induced by prostaglandin D2. J Pharmacol Exp Ther 314:244-51 (2005)  
Target
Name:
Cysteinyl leukotriene receptor 1
Synonyms:
CLTR1_HUMAN CYSLTR1 Cysteinyl leukotriene receptor HG55 LTD4 receptor | Leukotriene Cysteinyl 1
Type:
Enzyme Catalytic Domain
Mol. Mass.:
38565.16
Organism:
Homo sapiens (Human)
Description:
Leukotriene Cysteinyl 1 CYSLTR1 HUMAN::Q9Y271
Residue:
337
  
Inhibitor
Name:
BDBM86692
Synonyms:
K117
Type:
Small organic molecule
Emp. Form.:
C27H28N2O2
Mol. Mass.:
412.5234
SMILES:
CC(C)C(=O)N(C1CC(C)N(C(=O)c2ccccc2)c2ccccc12)c1ccccc1
: