Target
Adenosine receptor A2a
Ligand
BDBM86694
Substrate
Ki
>10000±n/a nM
Comments
PDSP_4918
Citation
 Miyata, NSeki, TTanaka, YOmura, TTaniguchi, KDoi, MBandou, KKametani, SSato, MOkuyama, SCambj-Sapunar, LHarder, DRRoman, RJ Beneficial effects of a new 20-hydroxyeicosatetraenoic acid synthesis inhibitor, TS-011 [N-(3-chloro-4-morpholin-4-yl) phenyl-N'-hydroxyimido formamide], on hemorrhagic and ischemic stroke. J Pharmacol Exp Ther 314:77-85 (2005)  
Target
Name:
Adenosine receptor A2a
Synonyms:
AA2AR_RAT Adenosine A2 receptor Adenosine Receptors A2a (A2a) Adenosine receptors A2a Rat striatal adenosine A2a receptor
Type:
G Protein-Coupled Receptor (GPCR)
Mol. Mass.:
45015.65
Organism:
Rattus norvegicus (rat)
Description:
Rat A2A receptors expressed in CHO cells.
Residue:
410
  
Inhibitor
Name:
BDBM86694
Synonyms:
N'-(3-Chloro-4-morpholinophenyl)-N-hydroxyformamidine | TS-011
Type:
Small organic molecule
Emp. Form.:
C11H14ClN3O2
Mol. Mass.:
255.701
SMILES:
ONC=Nc1ccc(N2CCOCC2)c(Cl)c1
: