Target
Metabotropic glutamate receptor 5
Ligand
BDBM86211
Substrate
Ki
>10000±n/a nM
Comments
PDSP_1580
Citation
 Porter, RHJaeschke, GSpooren, WBallard, TMBüttelmann, BKolczewski, SPeters, JUPrinssen, EWichmann, JVieira, EMühlemann, AGatti, SMutel, VMalherbe, P Fenobam: a clinically validated nonbenzodiazepine anxiolytic is a potent, selective, and noncompetitive mGlu5 receptor antagonist with inverse agonist activity. J Pharmacol Exp Ther 315:711-21 (2005)  
Target
Name:
Metabotropic glutamate receptor 5
Synonyms:
GPRC1E GRM5_HUMAN metabotropic glutamate 5 | metabotropic glutamate 5a
Type:
Enzyme
Mol. Mass.:
132484.72
Organism:
Homo sapiens (Human)
Description:
Residue:
1212
  
Inhibitor
Name:
BDBM86211
Synonyms:
CAS_52809-07-1 Quisqualate
Type:
Small organic molecule
Emp. Form.:
C5H7N3O5
Mol. Mass.:
189.1262
SMILES:
NC(Cn1oc(=O)[nH]c1=O)C(O)=O
: