Target
cGMP-dependent protein kinase 1
Ligand
BDBM86727
Substrate
Ki
5800±n/a nM
Comments
PDSP_6134
Citation
 Braverman, ASTibb, ASRuggieri, MR M2 and M3 muscarinic receptor activation of urinary bladder contractile signal transduction. I. Normal rat bladder. J Pharmacol Exp Ther 316:869-74 (2006)  
Target
Name:
cGMP-dependent protein kinase 1
Synonyms:
GMP-dependent protein kinase I PRKG1 PRKGR1A Protein Kinase G cGMP-dependent protein kinase 1 | cGMP-dependent protein kinase 1 beta
Type:
Protein
Mol. Mass.:
76358.04
Organism:
Homo sapiens (Human)
Description:
Q13976
Residue:
671
  
Inhibitor
Name:
BDBM86727
Synonyms:
1-(5-isoquinolinesulfonyl)-2-methylpiperazine.2HCl | CAS_140663-38-3
Type:
Small organic molecule
Emp. Form.:
C14H17N3O2S
Mol. Mass.:
291.369
SMILES:
CC1CN(CCN1)S(=O)(=O)c1cccc2cnccc12
: