Target
Neuronal acetylcholine receptor subunit alpha-2
Ligand
BDBM26739
Substrate
Ki
>10000±n/a nM
Comments
PDSP_5529
Citation
 Gobbi, GBambico, FRMangieri, RBortolato, MCampolongo, PSolinas, MCassano, TMorgese, MGDebonnel, GDuranti, ATontini, ATarzia, GMor, MTrezza, VGoldberg, SRCuomo, VPiomelli, D Antidepressant-like activity and modulation of brain monoaminergic transmission by blockade of anandamide hydrolysis. Proc Natl Acad Sci U S A 102:18620-5 (2005)  
Target
Name:
Neuronal acetylcholine receptor subunit alpha-2
Synonyms:
ACHA2_HUMAN Neuronal acetylcholine receptor; alpha2/beta2
Type:
Enzyme Catalytic Domain
Mol. Mass.:
59759.69
Organism:
Homo sapiens (Human)
Description:
Cholinergic, Nicotinic Alpha2Beta2 0 HUMAN::Q15822
Residue:
529
  
Inhibitor
Name:
BDBM26739
Synonyms:
3-(3-carbamoylphenyl)phenyl N-cyclohexylcarbamate URB 597 URB597 | US9187413, 1a (URB597)
Type:
Small organic molecule
Emp. Form.:
C20H22N2O3
Mol. Mass.:
338.4003
SMILES:
NC(=O)c1cccc(c1)-c1cccc(OC(=O)NC2CCCCC2)c1
: