Target
D(2) dopamine receptor
Ligand
BDBM26739
Substrate
Ki
>10000±n/a nM
Comments
PDSP_5529
Citation
 Gobbi, GBambico, FRMangieri, RBortolato, MCampolongo, PSolinas, MCassano, TMorgese, MGDebonnel, GDuranti, ATontini, ATarzia, GMor, MTrezza, VGoldberg, SRCuomo, VPiomelli, D Antidepressant-like activity and modulation of brain monoaminergic transmission by blockade of anandamide hydrolysis. Proc Natl Acad Sci U S A 102:18620-5 (2005)  
Target
Name:
D(2) dopamine receptor
Synonyms:
D(2) dopamine receptor DOPAMINE D2 Long DRD2 Dopamine D2 receptor Dopamine D2 receptor (D2R) Dopamine2-like | d2
Type:
Cell-surface receptors
Mol. Mass.:
50647.10
Organism:
Homo sapiens (Human)
Description:
P14416
Residue:
443
  
Inhibitor
Name:
BDBM26739
Synonyms:
3-(3-carbamoylphenyl)phenyl N-cyclohexylcarbamate URB 597 URB597 | US9187413, 1a (URB597)
Type:
Small organic molecule
Emp. Form.:
C20H22N2O3
Mol. Mass.:
338.4003
SMILES:
NC(=O)c1cccc(c1)-c1cccc(OC(=O)NC2CCCCC2)c1
: