Target
Mu-type opioid receptor
Ligand
BDBM26739
Substrate
Ki
>10000±n/a nM
Comments
PDSP_5529
Citation
 Gobbi, GBambico, FRMangieri, RBortolato, MCampolongo, PSolinas, MCassano, TMorgese, MGDebonnel, GDuranti, ATontini, ATarzia, GMor, MTrezza, VGoldberg, SRCuomo, VPiomelli, D Antidepressant-like activity and modulation of brain monoaminergic transmission by blockade of anandamide hydrolysis. Proc Natl Acad Sci U S A 102:18620-5 (2005)  
Target
Name:
Mu-type opioid receptor
Synonyms:
M-OR-1 MOR-1 MUOR1 Mu opiate receptor OPRM1 hMOP | mu-type opioid receptor isoform MOR-1
Type:
G Protein-Coupled Receptor (GPCR)
Mol. Mass.:
44789.51
Organism:
Homo sapiens (Human)
Description:
P35372
Residue:
400
  
Inhibitor
Name:
BDBM26739
Synonyms:
3-(3-carbamoylphenyl)phenyl N-cyclohexylcarbamate URB 597 URB597 | US9187413, 1a (URB597)
Type:
Small organic molecule
Emp. Form.:
C20H22N2O3
Mol. Mass.:
338.4003
SMILES:
NC(=O)c1cccc(c1)-c1cccc(OC(=O)NC2CCCCC2)c1
: