Target
Adenosine receptor A2b
Ligand
BDBM86748
Substrate
Ki
>10000±n/a nM
Comments
PDSP_7576
Citation
 Deecher, DCBeyer, CEJohnston, GBray, JShah, SAbou-Gharbia, MAndree, TH Desvenlafaxine succinate: A new serotonin and norepinephrine reuptake inhibitor. J Pharmacol Exp Ther 318:657-65 (2006)  
Target
Name:
Adenosine receptor A2b
Synonyms:
AA2BR_BOVIN ADORA2B
Type:
Enzyme Catalytic Domain
Mol. Mass.:
36398.35
Organism:
BOVINE
Description:
ADENOSINE A2 0 BOVINE::Q1LZD0
Residue:
332
  
Inhibitor
Name:
BDBM86748
Synonyms:
CAS_386750-22-7 NSC_6918664 US9944618, Compound ID No. 181
Type:
Small organic molecule
Emp. Form.:
C16H25NO2
Mol. Mass.:
263.3752
SMILES:
CN(C)CC(c1ccc(O)cc1)C1(O)CCCCC1
: