Target
D(1A) dopamine receptor
Ligand
BDBM86748
Substrate
Ki
>10000±n/a nM
Comments
PDSP_7576
Citation
 Deecher, DCBeyer, CEJohnston, GBray, JShah, SAbou-Gharbia, MAndree, TH Desvenlafaxine succinate: A new serotonin and norepinephrine reuptake inhibitor. J Pharmacol Exp Ther 318:657-65 (2006)  
Target
Name:
D(1A) dopamine receptor
Synonyms:
DA D1 receptor DRD1 Dopamine D1 receptor Dopamine D1A
Type:
Enzyme
Mol. Mass.:
49303.43
Organism:
Homo sapiens (Human)
Description:
P21728
Residue:
446
  
Inhibitor
Name:
BDBM86748
Synonyms:
CAS_386750-22-7 NSC_6918664 US9944618, Compound ID No. 181
Type:
Small organic molecule
Emp. Form.:
C16H25NO2
Mol. Mass.:
263.3752
SMILES:
CN(C)CC(c1ccc(O)cc1)C1(O)CCCCC1
: