Target
Glutamate receptor ionotropic, kainate 3
Ligand
BDBM86751
Substrate
Ki
>10000±n/a nM
Comments
PDSP_6659
Citation
 Weiss, BAlt, AOgden, AMGates, MDieckman, DKClemens-Smith, AHo, KHJarvie, KRizkalla, GWright, RACalligaro, DOSchoepp, DMattiuz, ELStratford, REJohnson, BSalhoff, CKatofiasc, MPhebus, LASchenck, KCohen, MFilla, SAOrnstein, PLJohnson, KWBleakman, D Pharmacological characterization of the competitive GLUK5 receptor antagonist decahydroisoquinoline LY466195 in vitro and in vivo. J Pharmacol Exp Ther 318:772-81 (2006)  
Target
Name:
Glutamate receptor ionotropic, kainate 3
Synonyms:
EAA5 GLUR7 GRIK3_HUMAN Glutamate receptor 7 Glutamate receptor ionotropic kainate 3 Glutamate-Kainate 7
Type:
Enzyme Catalytic Domain
Mol. Mass.:
104046.44
Organism:
Homo sapiens (Human)
Description:
Glutamate-Kainate 7 0 HUMAN::Q13003
Residue:
919
  
Inhibitor
Name:
BDBM86751
Synonyms:
CHEMBL14935 LY-293558
Type:
Small organic molecule
Emp. Form.:
C13H21N5O2
Mol. Mass.:
279.3381
SMILES:
OC(=O)[C@@H]1C[C@H]2C[C@@H](CCc3nnn[nH]3)CC[C@H]2CN1
: