Target
Histamine H4 receptor
Ligand
BDBM86708
Substrate
Ki
>10000±n/a nM
Comments
PDSP_1954
Citation
 Chemel, BRRoth, BLArmbruster, BWatts, VJNichols, DE WAY-100635 is a potent dopamine D4 receptor agonist. Psychopharmacology (Berl) 188:244-51 (2006)  
Target
Name:
Histamine H4 receptor
Synonyms:
AXOR35 GPCR105 HH4R HRH4 Histamine H4 receptor Histamine receptor (H3 and H4) SP9144
Type:
G Protein-Coupled Receptor (GPCR)
Mol. Mass.:
44517.02
Organism:
Homo sapiens (Human)
Description:
Binding assays were using CHO cells stably expressing hH4R receptors.
Residue:
390
  
Inhibitor
Name:
BDBM86708
Synonyms:
CAS_146714-97-8 CHEMBL514874 NSC_104911 | WAY 100,635
Type:
Small organic molecule
Emp. Form.:
C25H34N4O2
Mol. Mass.:
422.5631
SMILES:
COc1ccccc1N1CCN(CCN(C(=O)C2CCCCC2)c2ccccn2)CC1
: