Target
Carboxylic ester hydrolase
Ligand
BDBM86768
Substrate
Meas. Tech.
Enzyme Assay
IC50
1.45±n/a nM
Citation
 Szymanski, PMarkowicz, MMikiciuk-Olasik, E Synthesis and biological activity of derivatives of tetrahydroacridine as acetylcholinesterase inhibitors. Bioorg Chem 39:138-42 (2011)  
Target
Name:
Carboxylic ester hydrolase
Synonyms:
BuChE Butyrylcholine esterase Butyrylcholinesterase (BChE) Butyrylcholinesterase (EqBuChE) butyrylcholinesterase precursor
Type:
Protein
Mol. Mass.:
68842.83
Organism:
Equus caballus (Horse)
Description:
Q9N1N9
Residue:
602
  
Inhibitor
Name:
BDBM86768
Synonyms:
Nicotinamide hydrochloride analog, 6a
Type:
Small organic molecule
Emp. Form.:
C23H28N6O
Mol. Mass.:
404.508
SMILES:
NNc1ccc(cn1)C(=O)NCCCCNc1c2CCCCc2nc2ccccc12
: