Target
Amine oxidase [flavin-containing] A
Ligand
BDBM86780
Substrate
BDBM10990
Meas. Tech.
Inhibition Assay
pH
7.4±0
Temperature
203.15±0 K
IC50
2.45e+3± 231 nM
Citation
 Manley-King, CIBergh, JJPetzer, JP Monoamine oxidase inhibition by C4-substituted phthalonitriles. Bioorg Chem 40:114-24 (2012)  
Target
Name:
Amine oxidase [flavin-containing] A
Synonyms:
AOFA_HUMAN MAO-A Monoamine oxidase Monoamine oxidase type A (MAO A) Monoamine oxidase type A (MAOA)
Type:
Protein
Mol. Mass.:
59689.53
Organism:
Homo sapiens (Human)
Description:
P21397
Residue:
527
  
Inhibitor
Name:
BDBM86780
Synonyms:
Phthalonitrile analogue, 4i
Type:
Small organic molecule
Emp. Form.:
C16H11BrN2O
Mol. Mass.:
327.175
SMILES:
Brc1ccc(CCOc2ccc(C#N)c(c2)C#N)cc1
:
Substrate
Name:
BDBM10990
Synonyms:
3-amino-1-(2-aminophenyl)propan-1-one Kynuramine
Type:
Small organic molecule
Emp. Form.:
C9H12N2O
Mol. Mass.:
164.2044
SMILES:
NCCC(=O)c1ccccc1N
: