Target
Amine oxidase [flavin-containing] B
Ligand
BDBM86775
Substrate
BDBM10990
Meas. Tech.
Inhibition Assay
pH
7.4±0
Temperature
203.15±0 K
IC50
136± 16 nM
Citation
 Manley-King, CIBergh, JJPetzer, JP Monoamine oxidase inhibition by C4-substituted phthalonitriles. Bioorg Chem 40:114-24 (2012)  
Target
Name:
Amine oxidase [flavin-containing] B
Synonyms:
AOFB_HUMAN MAOB Monoamine oxidase type B (MAO B) Monoamine oxidase type B (MAOB)
Type:
Protein
Mol. Mass.:
58768.76
Organism:
Homo sapiens (Human)
Description:
P27338
Residue:
520
  
Inhibitor
Name:
BDBM86775
Synonyms:
Phthalonitrile analogue, 4d
Type:
Small organic molecule
Emp. Form.:
C17H14N2O
Mol. Mass.:
262.3059
SMILES:
N#Cc1ccc(OCCCc2ccccc2)cc1C#N
:
Substrate
Name:
BDBM10990
Synonyms:
3-amino-1-(2-aminophenyl)propan-1-one Kynuramine
Type:
Small organic molecule
Emp. Form.:
C9H12N2O
Mol. Mass.:
164.2044
SMILES:
NCCC(=O)c1ccccc1N
: