Target
Amine oxidase [flavin-containing] B
Ligand
BDBM86783
Substrate
BDBM10990
Meas. Tech.
Inhibition Assay
pH
7.4±0
Temperature
203.15±0 K
IC50
379± 39 nM
Citation
 Manley-King, CIBergh, JJPetzer, JP Monoamine oxidase inhibition by C4-substituted phthalonitriles. Bioorg Chem 40:114-24 (2012)  
Target
Name:
Amine oxidase [flavin-containing] B
Synonyms:
AOFB_HUMAN MAOB Monoamine oxidase type B (MAO B) Monoamine oxidase type B (MAOB)
Type:
Protein
Mol. Mass.:
58768.76
Organism:
Homo sapiens (Human)
Description:
P27338
Residue:
520
  
Inhibitor
Name:
BDBM86783
Synonyms:
Benzonitrile analogue, 5c
Type:
Small organic molecule
Emp. Form.:
C16H13NO
Mol. Mass.:
235.2805
SMILES:
N#Cc1ccc(OC\C=C\c2ccccc2)cc1
:
Substrate
Name:
BDBM10990
Synonyms:
3-amino-1-(2-aminophenyl)propan-1-one Kynuramine
Type:
Small organic molecule
Emp. Form.:
C9H12N2O
Mol. Mass.:
164.2044
SMILES:
NCCC(=O)c1ccccc1N
: