Target
Amine oxidase [flavin-containing] B
Ligand
BDBM86787
Substrate
BDBM10990
Meas. Tech.
Inhibition Assay
pH
7.4±0
Temperature
203.15±0 K
IC50
1.35e+3± 74 nM
Citation
 Manley-King, CIBergh, JJPetzer, JP Monoamine oxidase inhibition by C4-substituted phthalonitriles. Bioorg Chem 40:114-24 (2012)  
Target
Name:
Amine oxidase [flavin-containing] B
Synonyms:
AOFB_HUMAN MAOB Monoamine oxidase type B (MAO B) Monoamine oxidase type B (MAOB)
Type:
Protein
Mol. Mass.:
58768.76
Organism:
Homo sapiens (Human)
Description:
P27338
Residue:
520
  
Inhibitor
Name:
BDBM86787
Synonyms:
Benzonitrile analogue, 5g
Type:
Small organic molecule
Emp. Form.:
C15H12BrNO
Mol. Mass.:
302.166
SMILES:
Brc1ccc(CCOc2ccc(cc2)C#N)cc1
:
Substrate
Name:
BDBM10990
Synonyms:
3-amino-1-(2-aminophenyl)propan-1-one Kynuramine
Type:
Small organic molecule
Emp. Form.:
C9H12N2O
Mol. Mass.:
164.2044
SMILES:
NCCC(=O)c1ccccc1N
: