Target
Glutaminase kidney isoform, mitochondrial
Ligand
BDBM278407
Substrate
Meas. Tech.
GLS Enzyme Potency Assay
pH
7.8±n/a
IC50
85.1±n/a nM
Comments
extracted
Citation
 Finlay, MREkwuru, CTCharles, MDRaubo, PAWinter, JJNissink, JW 1,3,4-thiadiazole compounds and their use in treating cancer US Patent  US10040788 Publication Date 8/7/2018 
Target
Name:
Glutaminase kidney isoform, mitochondrial
Synonyms:
GLS GLSK_HUMAN K-glutaminase L-glutamine amidohydrolase
Type:
Protein
Mol. Mass.:
73471.89
Organism:
Homo sapiens (Human)
Description:
O94925
Residue:
669
  
Inhibitor
Name:
BDBM278407
Synonyms:
(2S)-2-[3-(Difluoromethoxy)phenyl]-2-methoxy-N-[5-[[(3R)-1-(1,2,4-triazin-3-yl)pyrrolidin-3-yl]amino]-1,3,4-thiadiazol-2-yl]acetamide US10040788, Example 6(a) | US10294221, Example 19(b)
Type:
Small organic molecule
Emp. Form.:
C19H20F2N8O3S
Mol. Mass.:
478.476
SMILES:
CO[C@H](C(=O)Nc1nnc(N[C@@H]2CCN(C2)c2nccnn2)s1)c1cccc(OC(F)F)c1
: