Target
Glutaminase kidney isoform, mitochondrial
Ligand
BDBM278409
Substrate
Meas. Tech.
GLS Enzyme Potency Assay
pH
7.8±n/a
IC50
14.8±n/a nM
Comments
extracted
Citation
 Finlay, MREkwuru, CTCharles, MDRaubo, PAWinter, JJNissink, JW 1,3,4-thiadiazole compounds and their use in treating cancer US Patent  US10040788 Publication Date 8/7/2018 
Target
Name:
Glutaminase kidney isoform, mitochondrial
Synonyms:
GLS GLSK_HUMAN K-glutaminase L-glutamine amidohydrolase
Type:
Protein
Mol. Mass.:
73471.89
Organism:
Homo sapiens (Human)
Description:
O94925
Residue:
669
  
Inhibitor
Name:
BDBM278409
Synonyms:
(2S)-2-[3-(Difluoromethoxy)phenyl]-2-methoxy-N-[5-[[(3R)-1-pyridazin-3-ylpyrrolidin-3-yl]amino]-1,3,4-thiadiazol-2-yl]acetamide US10294221, Example 7(a)
Type:
Small organic molecule
Emp. Form.:
C20H21F2N7O3S
Mol. Mass.:
477.488
SMILES:
CO[C@H](C(=O)Nc1nnc(N[C@@H]2CCN(C2)c2cccnn2)s1)c1cccc(OC(F)F)c1
: