Target
Glutaminase kidney isoform, mitochondrial
Ligand
BDBM50172240
Substrate
Meas. Tech.
GLS Enzyme Potency Assay
pH
7.8±n/a
IC50
2187±n/a nM
Comments
extracted
Citation
 Finlay, MREkwuru, CTCharles, MDRaubo, PAWinter, JJNissink, JW 1,3,4-thiadiazole compounds and their use in treating cancer US Patent  US10040788 Publication Date 8/7/2018 
Target
Name:
Glutaminase kidney isoform, mitochondrial
Synonyms:
GLS GLSK_HUMAN K-glutaminase L-glutamine amidohydrolase
Type:
Protein
Mol. Mass.:
73471.89
Organism:
Homo sapiens (Human)
Description:
O94925
Residue:
669
  
Inhibitor
Name:
BDBM50172240
Synonyms:
CHEMBL3808882 US10294221, Example 17(a)
Type:
Small organic molecule
Emp. Form.:
C18H19FN8O2S
Mol. Mass.:
430.459
SMILES:
CO[C@H](C(=O)Nc1nnc(N[C@@H]2CCN(C2)c2nccnn2)s1)c1ccc(F)cc1
: