Target
Glutaminase kidney isoform, mitochondrial
Ligand
BDBM278459
Substrate
Meas. Tech.
GLS Enzyme Potency Assay
pH
7.8±n/a
IC50
1946±n/a nM
Comments
extracted
Citation
 Finlay, MREkwuru, CTCharles, MDRaubo, PAWinter, JJNissink, JW 1,3,4-thiadiazole compounds and their use in treating cancer US Patent  US10040788 Publication Date 8/7/2018 
Target
Name:
Glutaminase kidney isoform, mitochondrial
Synonyms:
GLS GLSK_HUMAN K-glutaminase L-glutamine amidohydrolase
Type:
Protein
Mol. Mass.:
73471.89
Organism:
Homo sapiens (Human)
Description:
O94925
Residue:
669
  
Inhibitor
Name:
BDBM278459
Synonyms:
US10040788, Example 35(a) | US10294221, Example 35(a)
Type:
Small organic molecule
Emp. Form.:
C19H21FN8O2S
Mol. Mass.:
444.486
SMILES:
CCO[C@@H](C(=O)Nc1nnc(N[C@@H]2CCN(C2)c2nccnn2)s1)c1ccc(F)cc1
: