Target
Neuronal acetylcholine receptor subunit alpha-4
Ligand
BDBM86838
Substrate
Ki
2950±n/a nM
Comments
PDSP_8356
Citation
 Stoit, ARden Hartog, APMons, Hvan Schaik, SBarkhuijsen, NStroomer, CCoolen, HKReinders, JHAdolfs, TJvan der Neut, MKeizer, HKruse, CG 7-Azaindole derivatives as potential partial nicotinic agonists. Bioorg Med Chem Lett 18:188-93 (2008)  
Target
Name:
Neuronal acetylcholine receptor subunit alpha-4
Synonyms:
ACHA4_RAT Cholinergic, Nicotinic Alpha4Beta2 Chrna4 Neuronal acetylcholine receptor (alpha4beta2 nAChR) Neuronal acetylcholine receptor subunit alpha 4 beta 2 | Neuronal acetylcholine receptor subunit alpha-4
Type:
Enzyme
Mol. Mass.:
70196.44
Organism:
Rattus norvegicus (Rat)
Description:
P09483
Residue:
630
  
Inhibitor
Name:
BDBM86838
Synonyms:
6-chloro-3-(piperidin-3-yl)-1H-pyrrolo[2,3-b]pyridine NSC_24758034
Type:
Small organic molecule
Emp. Form.:
C12H14ClN3
Mol. Mass.:
235.713
SMILES:
Clc1ccc2c(c[nH]c2n1)C1CCCNC1
: