Target
Alpha-1A adrenergic receptor
Ligand
BDBM86847
Substrate
Ki
51±n/a nM
Comments
PDSP_8532
Citation
 Chiu, GLi, SConnolly, PJPulito, VLiu, JMiddleton, SA (Phenylpiperazinyl)cyclohexylureas: discovery of alpha1a/1d-selective adrenergic receptor antagonists for the treatment of benign prostatic hyperplasia/lower urinary tract symptoms (BPH/LUTS). Bioorg Med Chem Lett 18:640-4 (2008)  
Target
Name:
Alpha-1A adrenergic receptor
Synonyms:
ADA1A_HUMAN ADRA1C Alpha 1A-adrenoceptor Alpha adrenergic receptor 1a Alpha-adrenergic receptor 1c adrenergic Alpha1 | adrenergic Alpha1C
Type:
Cell-surface receptors
Mol. Mass.:
51511.67
Organism:
Homo sapiens (Human)
Description:
P35348
Residue:
466
  
Inhibitor
Name:
BDBM86847
Synonyms:
1-(4-(4-(2-isopropoxyphenyl)piperazin-1-yl)cyclohexyl)-3-(2,4,6-trichlorophenyl)urea NSC_16041449
Type:
Small organic molecule
Emp. Form.:
C26H33Cl3N4O2
Mol. Mass.:
539.925
SMILES:
CC(C)Oc1ccccc1N1CCN(CC1)C1CCC(CC1)NC(=O)Nc1c(Cl)cc(Cl)cc1Cl
: