Target
Alpha-1B adrenergic receptor
Ligand
BDBM86850
Substrate
Ki
76±n/a nM
Comments
PDSP_8537
Citation
 Chiu, GLi, SConnolly, PJPulito, VLiu, JMiddleton, SA (Phenylpiperazinyl)cyclohexylureas: discovery of alpha1a/1d-selective adrenergic receptor antagonists for the treatment of benign prostatic hyperplasia/lower urinary tract symptoms (BPH/LUTS). Bioorg Med Chem Lett 18:640-4 (2008)  
Target
Name:
Alpha-1B adrenergic receptor
Synonyms:
ADA1B_HUMAN Adrenergic alpha1B Adrenergic receptor alpha Alpha 1B-adrenoreceptor | Alpha-1B adrenergic receptor
Type:
Enzyme
Mol. Mass.:
56862.13
Organism:
Homo sapiens (Human)
Description:
P35368
Residue:
520
  
Inhibitor
Name:
BDBM86850
Synonyms:
1-(2,4-difluorophenyl)-3-(4-(4-(2-isopropoxyphenyl)piperazin-1-yl)cyclohexyl)urea NSC_16041628
Type:
Small organic molecule
Emp. Form.:
C26H34F2N4O2
Mol. Mass.:
472.5706
SMILES:
CC(C)Oc1ccccc1N1CCN(CC1)C1CCC(CC1)NC(=O)Nc1ccc(F)cc1F
: