Target
Alpha-1B adrenergic receptor
Ligand
BDBM86849
Substrate
Ki
69±n/a nM
Comments
PDSP_8531
Citation
 Chiu, GLi, SConnolly, PJPulito, VLiu, JMiddleton, SA (Phenylpiperazinyl)cyclohexylureas: discovery of alpha1a/1d-selective adrenergic receptor antagonists for the treatment of benign prostatic hyperplasia/lower urinary tract symptoms (BPH/LUTS). Bioorg Med Chem Lett 18:640-4 (2008)  
Target
Name:
Alpha-1B adrenergic receptor
Synonyms:
ADA1B_HUMAN Adrenergic alpha1B Adrenergic receptor alpha Alpha 1B-adrenoreceptor | Alpha-1B adrenergic receptor
Type:
Enzyme
Mol. Mass.:
56862.13
Organism:
Homo sapiens (Human)
Description:
P35368
Residue:
520
  
Inhibitor
Name:
BDBM86849
Synonyms:
1-(3-fluorobenzyl)-3-(4-(4-(2-isopropoxyphenyl)piperazin-1-yl)cyclohexyl)urea NSC_16041091
Type:
Small organic molecule
Emp. Form.:
C27H37FN4O2
Mol. Mass.:
468.6067
SMILES:
CC(C)Oc1ccccc1N1CCN(CC1)C1CCC(CC1)NC(=O)NCc1cccc(F)c1
: