Target
Tyrosine-protein kinase ABL1
Ligand
BDBM86865
Substrate
Ki
1260±n/a nM
Comments
PDSP_8403
Citation
 Radi, MCrespan, EBotta, GFalchi, FMaga, GManetti, FCorradi, VMancini, MSantucci, MASchenone, SBotta, M Discovery and SAR of 1,3,4-thiadiazole derivatives as potent Abl tyrosine kinase inhibitors and cytodifferentiating agents. Bioorg Med Chem Lett 18:1207-11 (2008)  
Target
Name:
Tyrosine-protein kinase ABL1
Synonyms:
ABL ABL1_HUMAN JTK7 Proto-oncogene tyrosine-protein kinase ABL1 Tyrosine-protein kinase ABL V-abl Abelson murine leukemia viral oncogene homolog 1 p150 | tyrosine-protein kinase ABL1 isoform a
Type:
Enzyme
Mol. Mass.:
122897.30
Organism:
Homo sapiens (Human)
Description:
P00519
Residue:
1130
  
Inhibitor
Name:
BDBM86865
Synonyms:
CAS_44454721 NSC_44454721
Type:
Small organic molecule
Emp. Form.:
C17H14ClN3O2S2
Mol. Mass.:
391.895
SMILES:
COc1ccc(CSc2nnc(NC(=O)c3ccccc3Cl)s2)cc1
: