Target
Tyrosine-protein kinase ABL1
Ligand
BDBM86856
Substrate
Ki
92±n/a nM
Comments
PDSP_8417
Citation
 Radi, MCrespan, EBotta, GFalchi, FMaga, GManetti, FCorradi, VMancini, MSantucci, MASchenone, SBotta, M Discovery and SAR of 1,3,4-thiadiazole derivatives as potent Abl tyrosine kinase inhibitors and cytodifferentiating agents. Bioorg Med Chem Lett 18:1207-11 (2008)  
Target
Name:
Tyrosine-protein kinase ABL1
Synonyms:
ABL ABL1_HUMAN JTK7 Proto-oncogene tyrosine-protein kinase ABL1 Tyrosine-protein kinase ABL V-abl Abelson murine leukemia viral oncogene homolog 1 p150 | tyrosine-protein kinase ABL1 isoform a
Type:
Enzyme
Mol. Mass.:
122897.30
Organism:
Homo sapiens (Human)
Description:
P00519
Residue:
1130
  
Inhibitor
Name:
BDBM86856
Synonyms:
CAS_44454904 NSC_44454904
Type:
Small organic molecule
Emp. Form.:
C16H11ClN4O3S2
Mol. Mass.:
406.867
SMILES:
[O-][N+](=O)c1ccc(CSc2nnc(NC(=O)c3ccc(Cl)cc3)s2)cc1
: