Target
Neuronal acetylcholine receptor subunit alpha-4
Ligand
BDBM86902
Substrate
Ki
1.07±n/a nM
Comments
PDSP_8511
Citation
 Charton, YGuillonneau, CLockhart, BLestage, PGoldstein, S Preparation and affinity profile of novel nicotinic ligands. Bioorg Med Chem Lett 18:2188-93 (2008)  
Target
Name:
Neuronal acetylcholine receptor subunit alpha-4
Synonyms:
ACHA4_RAT Cholinergic, Nicotinic Alpha4Beta2 Chrna4 Neuronal acetylcholine receptor (alpha4beta2 nAChR) Neuronal acetylcholine receptor subunit alpha 4 beta 2 | Neuronal acetylcholine receptor subunit alpha-4
Type:
Enzyme
Mol. Mass.:
70196.44
Organism:
Rattus norvegicus (Rat)
Description:
P09483
Residue:
630
  
Inhibitor
Name:
BDBM86902
Synonyms:
1-((5-bromopyridin-3-yloxy)methyl)-N-methylcyclopropanamine hydrochloride NSC_45266041
Type:
Small organic molecule
Emp. Form.:
C10H13BrN2O
Mol. Mass.:
257.127
SMILES:
CNC1(COc2cncc(Br)c2)CC1
: