Target
Muscarinic acetylcholine receptor M5
Ligand
BDBM81790
Substrate
Ki
>10000±n/a nM
Comments
PDSP_287
Citation
 Abbas, AIHedlund, PBHuang, XPTran, TBMeltzer, HYRoth, BL Amisulpride is a potent 5-HT7 antagonist: relevance for antidepressant actions in vivo. Psychopharmacology (Berl) 205:119-28 (2009)  
Target
Name:
Muscarinic acetylcholine receptor M5
Synonyms:
ACM5_HUMAN | CHRM5
Type:
PROTEIN
Mol. Mass.:
60102.35
Organism:
Homo sapiens (Human)
Description:
ChEMBL_1517990
Residue:
532
  
Inhibitor
Name:
BDBM81790
Synonyms:
Amisulpride NSC_2159 US10259786, Amisulpride
Type:
Small organic molecule
Emp. Form.:
C17H27N3O4S
Mol. Mass.:
369.479
SMILES:
CCN1CCCC1CNC(=O)c1cc(c(N)cc1OC)S(=O)(=O)CC
: