Target
D(4) dopamine receptor
Ligand
BDBM81790
Substrate
Ki
2369±n/a nM
Comments
PDSP_287
Citation
 Abbas, AIHedlund, PBHuang, XPTran, TBMeltzer, HYRoth, BL Amisulpride is a potent 5-HT7 antagonist: relevance for antidepressant actions in vivo. Psychopharmacology (Berl) 205:119-28 (2009)  
Target
Name:
D(4) dopamine receptor
Synonyms:
D(2C) dopamine receptor DOPAMINE D4.2 DRD4 Dopamine D4 receptor
Type:
Enzyme
Mol. Mass.:
48373.19
Organism:
Homo sapiens (Human)
Description:
P21917
Residue:
419
  
Inhibitor
Name:
BDBM81790
Synonyms:
Amisulpride NSC_2159 US10259786, Amisulpride
Type:
Small organic molecule
Emp. Form.:
C17H27N3O4S
Mol. Mass.:
369.479
SMILES:
CCN1CCCC1CNC(=O)c1cc(c(N)cc1OC)S(=O)(=O)CC
: