Target
Aurora kinase A
Ligand
BDBM87052
Substrate
Meas. Tech.
Enzyme Activity Assay
pH
7.4±0
Temperature
298.15±0 K
IC50
3.7±0.7 nM
Kd
16±1.6 nM
Citation
 Martin, MPZhu, JYLawrence, HRPireddu, RLuo, YAlam, ROzcan, SSebti, SMLawrence, NJSchönbrunn, E A novel mechanism by which small molecule inhibitors induce the DFG flip in Aurora A. ACS Chem Biol 7:698-706 (2012)  
Target
Name:
Aurora kinase A
Synonyms:
AIK ARK1 AURKA AYK1 Aurora kinase A (AURA) Aurora kinase A (Aurora A) Aurora-related kinase 1 BTAK Breast-tumor-amplified kinase STK15 Serine/threonine kinase 15 Serine/threonine-protein kinase aurora A hARK1
Type:
Serine/threonine-protein kinase
Mol. Mass.:
45830.98
Organism:
Homo sapiens (Human)
Description:
O14965
Residue:
403
  
Inhibitor
Name:
BDBM87052
Synonyms:
Bisanilinopyrimidine inhibitor, 6 US9249124, 24
Type:
Small organic molecule
Emp. Form.:
C17H13FN4O2
Mol. Mass.:
324.3091
SMILES:
OC(=O)c1ccc(Nc2nccc(Nc3ccccc3F)n2)cc1
: