Target
Chymotrypsin-C
Ligand
BDBM87060
Substrate
Meas. Tech.
Enzyme Inhibition Assay
pH
7.6±0
Temperature
298.15±0 K
Ki
4.711e+4± 7.2e+2 nM
Citation
 Arif Lodhi, MIqbal Choudhary, MMalik, AAhmad, S alpha-Chymotrypsin inhibition studies on the lignans from Vitex negundo Linn. J Enzyme Inhib Med Chem 23:400-5 (2008)  
Target
Name:
Chymotrypsin-C
Synonyms:
CLCR CTRC_HUMAN Chymotrypsin Chymotrypsin-C
Type:
Enzyme
Mol. Mass.:
29487.98
Organism:
Homo sapiens (Human)
Description:
Q99895
Residue:
268
  
Inhibitor
Name:
BDBM87060
Synonyms:
Lignan, 4 N-(4-methylcyclohexyl)-3-(4-methylpiperazin-1-yl)sulfonyl-benzamide N-(4-methylcyclohexyl)-3-(4-methylpiperazino)sulfonyl-benzamide SMR000715032 | cid_24983123
Type:
Small organic molecule
Emp. Form.:
C19H29N3O3S
Mol. Mass.:
379.517
SMILES:
CC1CCC(CC1)NC(=O)c1cccc(c1)S(=O)(=O)N1CCN(C)CC1
: